{"text_format":"3","workbook":"xlsx","n_sheets":3,"sheets":["2023","2024","2025"],"not_rendered":{"macros":1,"defined_names":6},"read":"whole","date_system":"1900"}

{"sheet":"2023","index":0,"n_rows":222,"n_cols":40,"rows_kept":222,"merged":[[1,0,1,2],[1,3,1,4],[2,0,2,2],[2,3,2,4],[9,0,10,2],[26,32,26,33],[27,0,28,2],[44,32,44,33],[45,0,46,2],[62,32,62,33],[63,0,64,2],[80,32,80,33],[81,0,82,2],[98,32,98,33],[99,0,100,2],[116,32,116,33],[117,0,118,2],[134,32,134,33],[135,0,136,2],[152,32,152,33],[153,0,154,2],[170,32,170,33],[171,0,172,2],[188,32,188,33],[189,0,190,2],[206,32,206,33],[207,0,208,2],[224,32,224,33]]}
[{"$nulls":12},13,14,15,16,17,18,19,20,21,22,23,{"$nulls":6},30,{"$nulls":3},34,35,{"$nulls":4},"Feriados"]
["D. de Início:",null,null,"2023-01-01",{"$nulls":35},"2013-01-01"]
["Nº de Meses:",null,null,12,{"$nulls":8},"Ano",null,"Horas",null,"Semana","Dias",null,"Fundo","Grelha","Inter.","Base"]
[]
[]
[{"$nulls":39},"2013-04-25"]
[{"$nulls":39},"2013-05-01"]
[{"$nulls":39},"2013-06-10"]
[]
[{"$f":"EOMONTH(D2,-1)+1","v":"2023-01-01"},null,null,{"$f":"IF(D11<>\"\",CHOOSE(WEEKDAY(D11,1),\"Dom.\",\"Seg.\",\"Ter.\",\"Qua.\",\"Qui.\",\"Sex.\",\"Sáb.\"),\"\")","v":"Dom."},{"$f":"IF(E11<>\"\",CHOOSE(WEEKDAY(E11,1),\"Dom.\",\"Seg.\",\"Ter.\",\"Qua.\",\"Qui.\",\"Sex.\",\"Sáb.\"),\"\")","v":"Seg."},"Ter.","Qua.","Qui.","Sex.","Sáb.","Dom.","Seg.","Ter.","Qua.","Qui.","Sex.","Sáb.","Dom.","Seg.","Ter.","Qua.","Qui.","Sex.","Sáb.","Dom.","Seg.","Ter.","Qua.","Qui.","Sex.","Sáb.","Dom.","Seg.","Ter.",{"$nulls":5},"2010-08-15"]
[{"$nulls":3},{"$f":"A10","v":"2023-01-01"},{"$f":"IF(D11=\"\",\"\",IF(DAY(D11)<DAY(EOMONTH(D11,0)),D11+1,\"\"))","v":"2023-01-02"},{"$f":"IF(E11=\"\",\"\",IF(DAY(E11)<DAY(EOMONTH(E11,0)),E11+1,\"\"))","v":"2023-01-03"},"2023-01-04","2023-01-05","2023-01-06","2023-01-07","2023-01-08","2023-01-09","2023-01-10","2023-01-11","2023-01-12","2023-01-13","2023-01-14","2023-01-15","2023-01-16","2023-01-17","2023-01-18","2023-01-19","2023-01-20","2023-01-21","2023-01-22","2023-01-23","2023-01-24","2023-01-25","2023-01-26","2023-01-27","2023-01-28","2023-01-29","2023-01-30","2023-01-31"]
[9,"-",10]
[10,"-",11,"Ano"]
[11,"-",12,"Novo",{"$nulls":35},"2010-12-08"]
[12,"-",13,{"$nulls":36},"2013-12-25"]
[]
[14,"-",15,{"$nulls":36},0]
[15,"-",16]
[16,"-",17]
[17,"-",18]
[]
[19,"-",20]
[20,"-",21]
[21,"-",22]
[]
[]
[]
["2023-02-01",null,null,{"$f":"IF(D29<>\"\",CHOOSE(WEEKDAY(D29,1),\"Dom.\",\"Seg.\",\"Ter.\",\"Qua.\",\"Qui.\",\"Sex.\",\"Sáb.\"),\"\")","v":"Qua."},{"$f":"IF(E29<>\"\",CHOOSE(WEEKDAY(E29,1),\"Dom.\",\"Seg.\",\"Ter.\",\"Qua.\",\"Qui.\",\"Sex.\",\"Sáb.\"),\"\")","v":"Qui."},"Sex.","Sáb.","Dom.","Seg.","Ter.","Qua.","Qui.","Sex.","Sáb.","Dom.","Seg.","Ter.","Qua.","Qui.","Sex.","Sáb.","Dom.","Seg.","Ter.","Qua.","Qui.","Sex.","Sáb.","Dom.","Seg.","Ter."]
[{"$nulls":3},{"$f":"A28","v":"2023-02-01"},{"$f":"IF(D29=\"\",\"\",IF(DAY(D29)<DAY(EOMONTH(D29,0)),D29+1,\"\"))","v":"2023-02-02"},{"$f":"IF(E29=\"\",\"\",IF(DAY(E29)<DAY(EOMONTH(E29,0)),E29+1,\"\"))","v":"2023-02-03"},"2023-02-04","2023-02-05","2023-02-06","2023-02-07","2023-02-08","2023-02-09","2023-02-10","2023-02-11","2023-02-12","2023-02-13","2023-02-14","2023-02-15","2023-02-16","2023-02-17","2023-02-18","2023-02-19","2023-02-20","2023-02-21","2023-02-22","2023-02-23","2023-02-24","2023-02-25","2023-02-26","2023-02-27","2023-02-28"]
[9,"-",10]
[10,"-",11]
[11,"-",12,{"$nulls":20},"Entrudo"]
[12,"-",13]
[]
[14,"-",15]
[15,"-",16]
[16,"-",17]
[17,"-",18]
[]
[19,"-",20]
[20,"-",21]
[21,"-",22]
[]
[]
[]
["2023-03-01",null,null,{"$f":"IF(D47<>\"\",CHOOSE(WEEKDAY(D47,1),\"Dom.\",\"Seg.\",\"Ter.\",\"Qua.\",\"Qui.\",\"Sex.\",\"Sáb.\"),\"\")","v":"Qua."},{"$f":"IF(E47<>\"\",CHOOSE(WEEKDAY(E47,1),\"Dom.\",\"Seg.\",\"Ter.\",\"Qua.\",\"Qui.\",\"Sex.\",\"Sáb.\"),\"\")","v":"Qui."},"Sex.","Sáb.","Dom.","Seg.","Ter.","Qua.","Qui.","Sex.","Sáb.","Dom.","Seg.","Ter.","Qua.","Qui.","Sex.","Sáb.","Dom.","Seg.","Ter.","Qua.","Qui.","Sex.","Sáb.","Dom.","Seg.","Ter.","Qua.","Qui.","Sex.",null,null,{"$f":"IF(AK47<>\"\",CHOOSE(WEEKDAY(AK47,1),\"Dom.\",\"Seg.\",\"Ter.\",\"Qua.\",\"Qui.\",\"Sex.\",\"Sáb.\"),\"\")","v":""}]
[{"$nulls":3},{"$f":"A46","v":"2023-03-01"},{"$f":"IF(D47=\"\",\"\",IF(DAY(D47)<DAY(EOMONTH(D47,0)),D47+1,\"\"))","v":"2023-03-02"},{"$f":"IF(E47=\"\",\"\",IF(DAY(E47)<DAY(EOMONTH(E47,0)),E47+1,\"\"))","v":"2023-03-03"},"2023-03-04","2023-03-05","2023-03-06","2023-03-07","2023-03-08","2023-03-09","2023-03-10","2023-03-11","2023-03-12","2023-03-13","2023-03-14","2023-03-15","2023-03-16","2023-03-17","2023-03-18","2023-03-19","2023-03-20","2023-03-21","2023-03-22","2023-03-23","2023-03-24","2023-03-25","2023-03-26","2023-03-27","2023-03-28","2023-03-29","2023-03-30","2023-03-31"]
[9,"-",10]
[10,"-",11]
[11,"-",12]
[12,"-",13]
[]
[14,"-",15]
[15,"-",16]
[16,"-",17]
[17,"-",18]
[]
[19,"-",20]
[20,"-",21]
[21,"-",22]
[]
[]
[{"$nulls":32},"V. Caetano"]
["2023-04-01",null,null,{"$f":"IF(D65<>\"\",CHOOSE(WEEKDAY(D65,1),\"Dom.\",\"Seg.\",\"Ter.\",\"Qua.\",\"Qui.\",\"Sex.\",\"Sáb.\"),\"\")","v":"Sáb."},{"$f":"IF(E65<>\"\",CHOOSE(WEEKDAY(E65,1),\"Dom.\",\"Seg.\",\"Ter.\",\"Qua.\",\"Qui.\",\"Sex.\",\"Sáb.\"),\"\")","v":"Dom."},"Seg.","Ter.","Qua.","Qui.","Sex.","Sáb.","Dom.","Seg.","Ter.","Qua.","Qui.","Sex.","Sáb.","Dom.","Seg.","Ter.","Qua.","Qui.","Sex.","Sáb.","Dom.","Seg.","Ter.","Qua.","Qui.","Sex.","Sáb.","Dom.",{"$nulls":3},{"$f":"IF(AK65<>\"\",CHOOSE(WEEKDAY(AK65,1),\"Dom.\",\"Seg.\",\"Ter.\",\"Qua.\",\"Qui.\",\"Sex.\",\"Sáb.\"),\"\")","v":""}]
[{"$nulls":3},{"$f":"A64","v":"2023-04-01"},{"$f":"IF(D65=\"\",\"\",IF(DAY(D65)<DAY(EOMONTH(D65,0)),D65+1,\"\"))","v":"2023-04-02"},{"$f":"IF(E65=\"\",\"\",IF(DAY(E65)<DAY(EOMONTH(E65,0)),E65+1,\"\"))","v":"2023-04-03"},"2023-04-04","2023-04-05","2023-04-06","2023-04-07","2023-04-08","2023-04-09","2023-04-10","2023-04-11","2023-04-12","2023-04-13","2023-04-14","2023-04-15","2023-04-16","2023-04-17","2023-04-18","2023-04-19","2023-04-20","2023-04-21","2023-04-22","2023-04-23","2023-04-24","2023-04-25","2023-04-26","2023-04-27","2023-04-28","2023-04-29","2023-04-30"]
[9,"-",10]
[10,"-",11]
[11,"-",12,{"$nulls":6},"Sexta",null,"Páscoa",{"$nulls":15},"Liberdade"]
[12,"-",13,{"$nulls":6},"Feira"]
[{"$nulls":9},"Santa"]
[14,"-",15]
[15,"-",16]
[16,"-",17]
[17,"-",18]
[]
[19,"-",20]
[20,"-",21]
[21,"-",22]
[]
[]
[]
["2023-05-01",null,null,{"$f":"IF(D83<>\"\",CHOOSE(WEEKDAY(D83,1),\"Dom.\",\"Seg.\",\"Ter.\",\"Qua.\",\"Qui.\",\"Sex.\",\"Sáb.\"),\"\")","v":"Seg."},{"$f":"IF(E83<>\"\",CHOOSE(WEEKDAY(E83,1),\"Dom.\",\"Seg.\",\"Ter.\",\"Qua.\",\"Qui.\",\"Sex.\",\"Sáb.\"),\"\")","v":"Ter."},"Qua.","Qui.","Sex.","Sáb.","Dom.","Seg.","Ter.","Qua.","Qui.","Sex.","Sáb.","Dom.","Seg.","Ter.","Qua.","Qui.","Sex.","Sáb.","Dom.","Seg.","Ter.","Qua.","Qui.","Sex.","Sáb.","Dom.","Seg.","Ter.","Qua.",null,null,{"$f":"IF(AK83<>\"\",CHOOSE(WEEKDAY(AK83,1),\"Dom.\",\"Seg.\",\"Ter.\",\"Qua.\",\"Qui.\",\"Sex.\",\"Sáb.\"),\"\")","v":""}]
[{"$nulls":3},{"$f":"A82","v":"2023-05-01"},{"$f":"IF(D83=\"\",\"\",IF(DAY(D83)<DAY(EOMONTH(D83,0)),D83+1,\"\"))","v":"2023-05-02"},{"$f":"IF(E83=\"\",\"\",IF(DAY(E83)<DAY(EOMONTH(E83,0)),E83+1,\"\"))","v":"2023-05-03"},"2023-05-04","2023-05-05","2023-05-06","2023-05-07","2023-05-08","2023-05-09","2023-05-10","2023-05-11","2023-05-12","2023-05-13","2023-05-14","2023-05-15","2023-05-16","2023-05-17","2023-05-18","2023-05-19","2023-05-20","2023-05-21","2023-05-22","2023-05-23","2023-05-24","2023-05-25","2023-05-26","2023-05-27","2023-05-28","2023-05-29","2023-05-30","2023-05-31"]
[9,"-",10]
[10,"-",11,{"$nulls":14},"Caldas"]
[11,"-",12,"Trabalh.",{"$nulls":13},"Rainha"]
[12,"-",13]
[]
[14,"-",15]
[15,"-",16]
[16,"-",17]
[17,"-",18]
[]
[19,"-",20]
[20,"-",21]
[21,"-",22]
[]
[]
[]
["2023-06-01",null,null,{"$f":"IF(D101<>\"\",CHOOSE(WEEKDAY(D101,1),\"Dom.\",\"Seg.\",\"Ter.\",\"Qua.\",\"Qui.\",\"Sex.\",\"Sáb.\"),\"\")","v":"Qui."},{"$f":"IF(E101<>\"\",CHOOSE(WEEKDAY(E101,1),\"Dom.\",\"Seg.\",\"Ter.\",\"Qua.\",\"Qui.\",\"Sex.\",\"Sáb.\"),\"\")","v":"Sex."},"Sáb.","Dom.","Seg.","Ter.","Qua.","Qui.","Sex.","Sáb.","Dom.","Seg.","Ter.","Qua.","Qui.","Sex.","Sáb.","Dom.","Seg.","Ter.","Qua.","Qui.","Sex.","Sáb.","Dom.","Seg.","Ter.","Qua.","Qui.","Sex.",{"$nulls":3},{"$f":"IF(AK101<>\"\",CHOOSE(WEEKDAY(AK101,1),\"Dom.\",\"Seg.\",\"Ter.\",\"Qua.\",\"Qui.\",\"Sex.\",\"Sáb.\"),\"\")","v":""}]
[{"$nulls":3},{"$f":"A100","v":"2023-06-01"},{"$f":"IF(D101=\"\",\"\",IF(DAY(D101)<DAY(EOMONTH(D101,0)),D101+1,\"\"))","v":"2023-06-02"},{"$f":"IF(E101=\"\",\"\",IF(DAY(E101)<DAY(EOMONTH(E101,0)),E101+1,\"\"))","v":"2023-06-03"},"2023-06-04","2023-06-05","2023-06-06","2023-06-07","2023-06-08","2023-06-09","2023-06-10","2023-06-11","2023-06-12","2023-06-13","2023-06-14","2023-06-15","2023-06-16","2023-06-17","2023-06-18","2023-06-19","2023-06-20","2023-06-21","2023-06-22","2023-06-23","2023-06-24","2023-06-25","2023-06-26","2023-06-27","2023-06-28","2023-06-29","2023-06-30"]
[9,"-",10]
[10,"-",11]
[11,"-",12,{"$nulls":7},"Corpo",null,"Portugal"]
[12,"-",13,{"$nulls":7},"Deus"]
[]
[14,"-",15]
[15,"-",16]
[16,"-",17]
[17,"-",18]
[]
[19,"-",20]
[20,"-",21]
[21,"-",22]
[]
[]
[]
["2023-07-01",null,null,{"$f":"IF(D119<>\"\",CHOOSE(WEEKDAY(D119,1),\"Dom.\",\"Seg.\",\"Ter.\",\"Qua.\",\"Qui.\",\"Sex.\",\"Sáb.\"),\"\")","v":"Sáb."},{"$f":"IF(E119<>\"\",CHOOSE(WEEKDAY(E119,1),\"Dom.\",\"Seg.\",\"Ter.\",\"Qua.\",\"Qui.\",\"Sex.\",\"Sáb.\"),\"\")","v":"Dom."},"Seg.","Ter.","Qua.","Qui.","Sex.","Sáb.","Dom.","Seg.","Ter.","Qua.","Qui.","Sex.","Sáb.","Dom.","Seg.","Ter.","Qua.","Qui.","Sex.","Sáb.","Dom.","Seg.","Ter.","Qua.","Qui.","Sex.","Sáb.","Dom.","Seg.",null,null,{"$f":"IF(AK119<>\"\",CHOOSE(WEEKDAY(AK119,1),\"Dom.\",\"Seg.\",\"Ter.\",\"Qua.\",\"Qui.\",\"Sex.\",\"Sáb.\"),\"\")","v":""}]
[{"$nulls":3},{"$f":"A118","v":"2023-07-01"},{"$f":"IF(D119=\"\",\"\",IF(DAY(D119)<DAY(EOMONTH(D119,0)),D119+1,\"\"))","v":"2023-07-02"},{"$f":"IF(E119=\"\",\"\",IF(DAY(E119)<DAY(EOMONTH(E119,0)),E119+1,\"\"))","v":"2023-07-03"},"2023-07-04","2023-07-05","2023-07-06","2023-07-07","2023-07-08","2023-07-09","2023-07-10","2023-07-11","2023-07-12","2023-07-13","2023-07-14","2023-07-15","2023-07-16","2023-07-17","2023-07-18","2023-07-19","2023-07-20","2023-07-21","2023-07-22","2023-07-23","2023-07-24","2023-07-25","2023-07-26","2023-07-27","2023-07-28","2023-07-29","2023-07-30","2023-07-31"]
[9,"-",10]
[10,"-",11]
[11,"-",12]
[12,"-",13]
[]
[14,"-",15]
[15,"-",16]
[16,"-",17]
[17,"-",18]
[]
[19,"-",20]
[20,"-",21]
[21,"-",22]
[]
[]
[{"$nulls":32},"V. Caetano"]
["2023-08-01",null,null,{"$f":"IF(D137<>\"\",CHOOSE(WEEKDAY(D137,1),\"Dom.\",\"Seg.\",\"Ter.\",\"Qua.\",\"Qui.\",\"Sex.\",\"Sáb.\"),\"\")","v":"Ter."},{"$f":"IF(E137<>\"\",CHOOSE(WEEKDAY(E137,1),\"Dom.\",\"Seg.\",\"Ter.\",\"Qua.\",\"Qui.\",\"Sex.\",\"Sáb.\"),\"\")","v":"Qua."},"Qui.","Sex.","Sáb.","Dom.","Seg.","Ter.","Qua.","Qui.","Sex.","Sáb.","Dom.","Seg.","Ter.","Qua.","Qui.","Sex.","Sáb.","Dom.","Seg.","Ter.","Qua.","Qui.","Sex.","Sáb.","Dom.","Seg.","Ter.","Qua.","Qui.",null,null,{"$f":"IF(AK137<>\"\",CHOOSE(WEEKDAY(AK137,1),\"Dom.\",\"Seg.\",\"Ter.\",\"Qua.\",\"Qui.\",\"Sex.\",\"Sáb.\"),\"\")","v":""}]
[{"$nulls":3},{"$f":"A136","v":"2023-08-01"},{"$f":"IF(D137=\"\",\"\",IF(DAY(D137)<DAY(EOMONTH(D137,0)),D137+1,\"\"))","v":"2023-08-02"},{"$f":"IF(E137=\"\",\"\",IF(DAY(E137)<DAY(EOMONTH(E137,0)),E137+1,\"\"))","v":"2023-08-03"},"2023-08-04","2023-08-05","2023-08-06","2023-08-07","2023-08-08","2023-08-09","2023-08-10","2023-08-11","2023-08-12","2023-08-13","2023-08-14","2023-08-15","2023-08-16","2023-08-17","2023-08-18","2023-08-19","2023-08-20","2023-08-21","2023-08-22","2023-08-23","2023-08-24","2023-08-25","2023-08-26","2023-08-27","2023-08-28","2023-08-29","2023-08-30","2023-08-31"]
[9,"-",10]
[10,"-",11,{"$nulls":14},"Assunção"]
[11,"-",12,{"$nulls":14},"Nossa"]
[12,"-",13,{"$nulls":14},"Senhora"]
[]
[14,"-",15]
[15,"-",16]
[16,"-",17]
[17,"-",18]
[]
[19,"-",20]
[20,"-",21]
[21,"-",22]
[]
[]
[]
["2023-09-01",null,null,{"$f":"IF(D155<>\"\",CHOOSE(WEEKDAY(D155,1),\"Dom.\",\"Seg.\",\"Ter.\",\"Qua.\",\"Qui.\",\"Sex.\",\"Sáb.\"),\"\")","v":"Sex."},{"$f":"IF(E155<>\"\",CHOOSE(WEEKDAY(E155,1),\"Dom.\",\"Seg.\",\"Ter.\",\"Qua.\",\"Qui.\",\"Sex.\",\"Sáb.\"),\"\")","v":"Sáb."},"Dom.","Seg.","Ter.","Qua.","Qui.","Sex.","Sáb.","Dom.","Seg.","Ter.","Qua.","Qui.","Sex.","Sáb.","Dom.","Seg.","Ter.","Qua.","Qui.","Sex.","Sáb.","Dom.","Seg.","Ter.","Qua.","Qui.","Sex.","Sáb.",{"$nulls":3},{"$f":"IF(AK155<>\"\",CHOOSE(WEEKDAY(AK155,1),\"Dom.\",\"Seg.\",\"Ter.\",\"Qua.\",\"Qui.\",\"Sex.\",\"Sáb.\"),\"\")","v":""}]
[{"$nulls":3},{"$f":"A154","v":"2023-09-01"},{"$f":"IF(D155=\"\",\"\",IF(DAY(D155)<DAY(EOMONTH(D155,0)),D155+1,\"\"))","v":"2023-09-02"},{"$f":"IF(E155=\"\",\"\",IF(DAY(E155)<DAY(EOMONTH(E155,0)),E155+1,\"\"))","v":"2023-09-03"},"2023-09-04","2023-09-05","2023-09-06","2023-09-07","2023-09-08","2023-09-09","2023-09-10","2023-09-11","2023-09-12","2023-09-13","2023-09-14","2023-09-15","2023-09-16","2023-09-17","2023-09-18","2023-09-19","2023-09-20","2023-09-21","2023-09-22","2023-09-23","2023-09-24","2023-09-25","2023-09-26","2023-09-27","2023-09-28","2023-09-29","2023-09-30"]
[9,"-",10]
[10,"-",11]
[11,"-",12]
[12,"-",13]
[]
[14,"-",15]
[15,"-",16]
[16,"-",17]
[17,"-",18]
[]
[19,"-",20]
[20,"-",21]
[21,"-",22]
[]
[]
[]
["2023-10-01",null,null,{"$f":"IF(D173<>\"\",CHOOSE(WEEKDAY(D173,1),\"Dom.\",\"Seg.\",\"Ter.\",\"Qua.\",\"Qui.\",\"Sex.\",\"Sáb.\"),\"\")","v":"Dom."},{"$f":"IF(E173<>\"\",CHOOSE(WEEKDAY(E173,1),\"Dom.\",\"Seg.\",\"Ter.\",\"Qua.\",\"Qui.\",\"Sex.\",\"Sáb.\"),\"\")","v":"Seg."},"Ter.","Qua.","Qui.","Sex.","Sáb.","Dom.","Seg.","Ter.","Qua.","Qui.","Sex.","Sáb.","Dom.","Seg.","Ter.","Qua.","Qui.","Sex.","Sáb.","Dom.","Seg.","Ter.","Qua.","Qui.","Sex.","Sáb.","Dom.","Seg.","Ter.",null,null,{"$f":"IF(AK173<>\"\",CHOOSE(WEEKDAY(AK173,1),\"Dom.\",\"Seg.\",\"Ter.\",\"Qua.\",\"Qui.\",\"Sex.\",\"Sáb.\"),\"\")","v":""}]
[{"$nulls":3},{"$f":"A172","v":"2023-10-01"},{"$f":"IF(D173=\"\",\"\",IF(DAY(D173)<DAY(EOMONTH(D173,0)),D173+1,\"\"))","v":"2023-10-02"},{"$f":"IF(E173=\"\",\"\",IF(DAY(E173)<DAY(EOMONTH(E173,0)),E173+1,\"\"))","v":"2023-10-03"},"2023-10-04","2023-10-05","2023-10-06","2023-10-07","2023-10-08","2023-10-09","2023-10-10","2023-10-11","2023-10-12","2023-10-13","2023-10-14","2023-10-15","2023-10-16","2023-10-17","2023-10-18","2023-10-19","2023-10-20","2023-10-21","2023-10-22","2023-10-23","2023-10-24","2023-10-25","2023-10-26","2023-10-27","2023-10-28","2023-10-29","2023-10-30","2023-10-31"]
[9,"-",10]
[10,"-",11]
[11,"-",12,{"$nulls":4},"República"]
[12,"-",13]
[]
[14,"-",15]
[15,"-",16]
[16,"-",17]
[17,"-",18]
[]
[19,"-",20]
[20,"-",21]
[21,"-",22]
[]
[]
[{"$nulls":32},"V. Caetano"]
["2023-11-01",null,null,{"$f":"IF(D191<>\"\",CHOOSE(WEEKDAY(D191,1),\"Dom.\",\"Seg.\",\"Ter.\",\"Qua.\",\"Qui.\",\"Sex.\",\"Sáb.\"),\"\")","v":"Qua."},{"$f":"IF(E191<>\"\",CHOOSE(WEEKDAY(E191,1),\"Dom.\",\"Seg.\",\"Ter.\",\"Qua.\",\"Qui.\",\"Sex.\",\"Sáb.\"),\"\")","v":"Qui."},"Sex.","Sáb.","Dom.","Seg.","Ter.","Qua.","Qui.","Sex.","Sáb.","Dom.","Seg.","Ter.","Qua.","Qui.","Sex.","Sáb.","Dom.","Seg.","Ter.","Qua.","Qui.","Sex.","Sáb.","Dom.","Seg.","Ter.","Qua.","Qui.",{"$nulls":3},{"$f":"IF(AK191<>\"\",CHOOSE(WEEKDAY(AK191,1),\"Dom.\",\"Seg.\",\"Ter.\",\"Qua.\",\"Qui.\",\"Sex.\",\"Sáb.\"),\"\")","v":""}]
[{"$nulls":3},{"$f":"A190","v":"2023-11-01"},{"$f":"IF(D191=\"\",\"\",IF(DAY(D191)<DAY(EOMONTH(D191,0)),D191+1,\"\"))","v":"2023-11-02"},{"$f":"IF(E191=\"\",\"\",IF(DAY(E191)<DAY(EOMONTH(E191,0)),E191+1,\"\"))","v":"2023-11-03"},"2023-11-04","2023-11-05","2023-11-06","2023-11-07","2023-11-08","2023-11-09","2023-11-10","2023-11-11","2023-11-12","2023-11-13","2023-11-14","2023-11-15","2023-11-16","2023-11-17","2023-11-18","2023-11-19","2023-11-20","2023-11-21","2023-11-22","2023-11-23","2023-11-24","2023-11-25","2023-11-26","2023-11-27","2023-11-28","2023-11-29","2023-11-30"]
[9,"-",10]
[10,"-",11]
[11,"-",12,"Todos",{"$nulls":9},"São"]
[12,"-",13,"Santos",{"$nulls":9},"Martinho"]
[]
[14,"-",15]
[15,"-",16,{"$nulls":10},"Torres"]
[16,"-",17,{"$nulls":10},"Vedras"]
[17,"-",18]
[]
[19,"-",20]
[20,"-",21]
[21,"-",22]
[]
[]
[]
["2023-12-01",null,null,{"$f":"IF(D209<>\"\",CHOOSE(WEEKDAY(D209,1),\"Dom.\",\"Seg.\",\"Ter.\",\"Qua.\",\"Qui.\",\"Sex.\",\"Sáb.\"),\"\")","v":"Sex."},{"$f":"IF(E209<>\"\",CHOOSE(WEEKDAY(E209,1),\"Dom.\",\"Seg.\",\"Ter.\",\"Qua.\",\"Qui.\",\"Sex.\",\"Sáb.\"),\"\")","v":"Sáb."},"Dom.","Seg.","Ter.","Qua.","Qui.","Sex.","Sáb.","Dom.","Seg.","Ter.","Qua.","Qui.","Sex.","Sáb.","Dom.","Seg.","Ter.","Qua.","Qui.","Sex.","Sáb.","Dom.","Seg.","Ter.","Qua.","Qui.","Sex.","Sáb.","Dom.",null,null,{"$f":"IF(AK209<>\"\",CHOOSE(WEEKDAY(AK209,1),\"Dom.\",\"Seg.\",\"Ter.\",\"Qua.\",\"Qui.\",\"Sex.\",\"Sáb.\"),\"\")","v":""}]
[{"$nulls":3},{"$f":"A208","v":"2023-12-01"},{"$f":"IF(D209=\"\",\"\",IF(DAY(D209)<DAY(EOMONTH(D209,0)),D209+1,\"\"))","v":"2023-12-02"},{"$f":"IF(E209=\"\",\"\",IF(DAY(E209)<DAY(EOMONTH(E209,0)),E209+1,\"\"))","v":"2023-12-03"},"2023-12-04","2023-12-05","2023-12-06","2023-12-07","2023-12-08","2023-12-09","2023-12-10","2023-12-11","2023-12-12","2023-12-13","2023-12-14","2023-12-15","2023-12-16","2023-12-17","2023-12-18","2023-12-19","2023-12-20","2023-12-21","2023-12-22","2023-12-23","2023-12-24","2023-12-25","2023-12-26","2023-12-27","2023-12-28","2023-12-29","2023-12-30","2023-12-31"]
[9,"-",10]
[10,"-",11]
[11,"-",12,"Rest.",{"$nulls":6},"Imacu.",{"$nulls":16},"Natal"]
[12,"-",13,"Indep.",{"$nulls":6},"Conceição"]
[]
[14,"-",15]
[15,"-",16]
[16,"-",17]
[17,"-",18]
[]
[19,"-",20]
[20,"-",21]
[21,"-",22]

{"sheet":"2024","index":1,"n_rows":222,"n_cols":40,"rows_kept":222,"merged":[[1,0,1,2],[1,3,1,4],[2,0,2,2],[2,3,2,4],[9,0,10,2],[26,32,26,33],[27,0,28,2],[44,32,44,33],[45,0,46,2],[62,32,62,33],[63,0,64,2],[80,32,80,33],[81,0,82,2],[98,32,98,33],[99,0,100,2],[116,32,116,33],[117,0,118,2],[134,32,134,33],[135,0,136,2],[152,32,152,33],[153,0,154,2],[170,32,170,33],[171,0,172,2],[188,32,188,33],[189,0,190,2],[206,32,206,33],[207,0,208,2],[224,32,224,33]]}
[{"$nulls":12},13,14,15,16,17,18,19,20,21,22,23,{"$nulls":6},30,{"$nulls":3},34,35,{"$nulls":4},"Feriados"]
["D. de Início:",null,null,"2024-01-01",{"$nulls":35},"2013-01-01"]
["Nº de Meses:",null,null,12,{"$nulls":8},"Ano",null,"Horas",null,"Semana","Dias",null,"Fundo","Grelha","Inter.","Base"]
[]
[]
[{"$nulls":39},"2013-04-25"]
[{"$nulls":39},"2013-05-01"]
[{"$nulls":39},"2013-06-10"]
[]
[{"$f":"EOMONTH(D2,-1)+1","v":"2024-01-01"},null,null,{"$f":"IF(D11<>\"\",CHOOSE(WEEKDAY(D11,1),\"Dom.\",\"Seg.\",\"Ter.\",\"Qua.\",\"Qui.\",\"Sex.\",\"Sáb.\"),\"\")","v":"Seg."},{"$f":"IF(E11<>\"\",CHOOSE(WEEKDAY(E11,1),\"Dom.\",\"Seg.\",\"Ter.\",\"Qua.\",\"Qui.\",\"Sex.\",\"Sáb.\"),\"\")","v":"Ter."},"Qua.","Qui.","Sex.","Sáb.","Dom.","Seg.","Ter.","Qua.","Qui.","Sex.","Sáb.","Dom.","Seg.","Ter.","Qua.","Qui.","Sex.","Sáb.","Dom.","Seg.","Ter.","Qua.","Qui.","Sex.","Sáb.","Dom.","Seg.","Ter.","Qua.",{"$nulls":5},"2010-08-15"]
[{"$nulls":3},{"$f":"A10","v":"2024-01-01"},{"$f":"IF(D11=\"\",\"\",IF(DAY(D11)<DAY(EOMONTH(D11,0)),D11+1,\"\"))","v":"2024-01-02"},{"$f":"IF(E11=\"\",\"\",IF(DAY(E11)<DAY(EOMONTH(E11,0)),E11+1,\"\"))","v":"2024-01-03"},"2024-01-04","2024-01-05","2024-01-06","2024-01-07","2024-01-08","2024-01-09","2024-01-10","2024-01-11","2024-01-12","2024-01-13","2024-01-14","2024-01-15","2024-01-16","2024-01-17","2024-01-18","2024-01-19","2024-01-20","2024-01-21","2024-01-22","2024-01-23","2024-01-24","2024-01-25","2024-01-26","2024-01-27","2024-01-28","2024-01-29","2024-01-30","2024-01-31"]
[9,"-",10]
[10,"-",11,"Ano"]
[11,"-",12,"Novo",{"$nulls":35},"2010-12-08"]
[12,"-",13,{"$nulls":36},"2013-12-25"]
[]
[14,"-",15,{"$nulls":36},0]
[15,"-",16]
[16,"-",17]
[17,"-",18]
[]
[19,"-",20]
[20,"-",21]
[21,"-",22]
[]
[]
[]
["2024-02-01",null,null,{"$f":"IF(D29<>\"\",CHOOSE(WEEKDAY(D29,1),\"Dom.\",\"Seg.\",\"Ter.\",\"Qua.\",\"Qui.\",\"Sex.\",\"Sáb.\"),\"\")","v":"Qui."},{"$f":"IF(E29<>\"\",CHOOSE(WEEKDAY(E29,1),\"Dom.\",\"Seg.\",\"Ter.\",\"Qua.\",\"Qui.\",\"Sex.\",\"Sáb.\"),\"\")","v":"Sex."},"Sáb.","Dom.","Seg.","Ter.","Qua.","Qui.","Sex.","Sáb.","Dom.","Seg.","Ter.","Qua.","Qui.","Sex.","Sáb.","Dom.","Seg.","Ter.","Qua.","Qui.","Sex.","Sáb.","Dom.","Seg.","Ter.","Qua.","Qui."]
[{"$nulls":3},{"$f":"A28","v":"2024-02-01"},{"$f":"IF(D29=\"\",\"\",IF(DAY(D29)<DAY(EOMONTH(D29,0)),D29+1,\"\"))","v":"2024-02-02"},{"$f":"IF(E29=\"\",\"\",IF(DAY(E29)<DAY(EOMONTH(E29,0)),E29+1,\"\"))","v":"2024-02-03"},"2024-02-04","2024-02-05","2024-02-06","2024-02-07","2024-02-08","2024-02-09","2024-02-10","2024-02-11","2024-02-12","2024-02-13","2024-02-14","2024-02-15","2024-02-16","2024-02-17","2024-02-18","2024-02-19","2024-02-20","2024-02-21","2024-02-22","2024-02-23","2024-02-24","2024-02-25","2024-02-26","2024-02-27","2024-02-28","2024-02-29"]
[9,"-",10]
[10,"-",11]
[11,"-",12,{"$nulls":12},"Entrudo"]
[12,"-",13]
[]
[14,"-",15]
[15,"-",16]
[16,"-",17]
[17,"-",18]
[]
[19,"-",20]
[20,"-",21]
[21,"-",22]
[]
[]
[]
["2024-03-01",null,null,{"$f":"IF(D47<>\"\",CHOOSE(WEEKDAY(D47,1),\"Dom.\",\"Seg.\",\"Ter.\",\"Qua.\",\"Qui.\",\"Sex.\",\"Sáb.\"),\"\")","v":"Sex."},{"$f":"IF(E47<>\"\",CHOOSE(WEEKDAY(E47,1),\"Dom.\",\"Seg.\",\"Ter.\",\"Qua.\",\"Qui.\",\"Sex.\",\"Sáb.\"),\"\")","v":"Sáb."},"Dom.","Seg.","Ter.","Qua.","Qui.","Sex.","Sáb.","Dom.","Seg.","Ter.","Qua.","Qui.","Sex.","Sáb.","Dom.","Seg.","Ter.","Qua.","Qui.","Sex.","Sáb.","Dom.","Seg.","Ter.","Qua.","Qui.","Sex.","Sáb.","Dom.",null,null,{"$f":"IF(AK47<>\"\",CHOOSE(WEEKDAY(AK47,1),\"Dom.\",\"Seg.\",\"Ter.\",\"Qua.\",\"Qui.\",\"Sex.\",\"Sáb.\"),\"\")","v":""}]
[{"$nulls":3},{"$f":"A46","v":"2024-03-01"},{"$f":"IF(D47=\"\",\"\",IF(DAY(D47)<DAY(EOMONTH(D47,0)),D47+1,\"\"))","v":"2024-03-02"},{"$f":"IF(E47=\"\",\"\",IF(DAY(E47)<DAY(EOMONTH(E47,0)),E47+1,\"\"))","v":"2024-03-03"},"2024-03-04","2024-03-05","2024-03-06","2024-03-07","2024-03-08","2024-03-09","2024-03-10","2024-03-11","2024-03-12","2024-03-13","2024-03-14","2024-03-15","2024-03-16","2024-03-17","2024-03-18","2024-03-19","2024-03-20","2024-03-21","2024-03-22","2024-03-23","2024-03-24","2024-03-25","2024-03-26","2024-03-27","2024-03-28","2024-03-29","2024-03-30","2024-03-31"]
[9,"-",10]
[10,"-",11,{"$nulls":28},"Sexta"]
[11,"-",12,{"$nulls":28},"Santa",null,"Páscoa"]
[12,"-",13]
[]
[14,"-",15]
[15,"-",16]
[16,"-",17]
[17,"-",18]
[]
[19,"-",20]
[20,"-",21]
[21,"-",22]
[]
[]
[{"$nulls":32},"V. Caetano"]
["2024-04-01",null,null,{"$f":"IF(D65<>\"\",CHOOSE(WEEKDAY(D65,1),\"Dom.\",\"Seg.\",\"Ter.\",\"Qua.\",\"Qui.\",\"Sex.\",\"Sáb.\"),\"\")","v":"Seg."},{"$f":"IF(E65<>\"\",CHOOSE(WEEKDAY(E65,1),\"Dom.\",\"Seg.\",\"Ter.\",\"Qua.\",\"Qui.\",\"Sex.\",\"Sáb.\"),\"\")","v":"Ter."},"Qua.","Qui.","Sex.","Sáb.","Dom.","Seg.","Ter.","Qua.","Qui.","Sex.","Sáb.","Dom.","Seg.","Ter.","Qua.","Qui.","Sex.","Sáb.","Dom.","Seg.","Ter.","Qua.","Qui.","Sex.","Sáb.","Dom.","Seg.","Ter.",{"$nulls":3},{"$f":"IF(AK65<>\"\",CHOOSE(WEEKDAY(AK65,1),\"Dom.\",\"Seg.\",\"Ter.\",\"Qua.\",\"Qui.\",\"Sex.\",\"Sáb.\"),\"\")","v":""}]
[{"$nulls":3},{"$f":"A64","v":"2024-04-01"},{"$f":"IF(D65=\"\",\"\",IF(DAY(D65)<DAY(EOMONTH(D65,0)),D65+1,\"\"))","v":"2024-04-02"},{"$f":"IF(E65=\"\",\"\",IF(DAY(E65)<DAY(EOMONTH(E65,0)),E65+1,\"\"))","v":"2024-04-03"},"2024-04-04","2024-04-05","2024-04-06","2024-04-07","2024-04-08","2024-04-09","2024-04-10","2024-04-11","2024-04-12","2024-04-13","2024-04-14","2024-04-15","2024-04-16","2024-04-17","2024-04-18","2024-04-19","2024-04-20","2024-04-21","2024-04-22","2024-04-23","2024-04-24","2024-04-25","2024-04-26","2024-04-27","2024-04-28","2024-04-29","2024-04-30"]
[9,"-",10]
[10,"-",11]
[11,"-",12,{"$nulls":24},"Liberd."]
[12,"-",13]
[]
[14,"-",15]
[15,"-",16]
[16,"-",17]
[17,"-",18]
[]
[19,"-",20]
[20,"-",21]
[21,"-",22]
[]
[]
[]
["2024-05-01",null,null,{"$f":"IF(D83<>\"\",CHOOSE(WEEKDAY(D83,1),\"Dom.\",\"Seg.\",\"Ter.\",\"Qua.\",\"Qui.\",\"Sex.\",\"Sáb.\"),\"\")","v":"Qua."},{"$f":"IF(E83<>\"\",CHOOSE(WEEKDAY(E83,1),\"Dom.\",\"Seg.\",\"Ter.\",\"Qua.\",\"Qui.\",\"Sex.\",\"Sáb.\"),\"\")","v":"Qui."},"Sex.","Sáb.","Dom.","Seg.","Ter.","Qua.","Qui.","Sex.","Sáb.","Dom.","Seg.","Ter.","Qua.","Qui.","Sex.","Sáb.","Dom.","Seg.","Ter.","Qua.","Qui.","Sex.","Sáb.","Dom.","Seg.","Ter.","Qua.","Qui.","Sex.",null,null,{"$f":"IF(AK83<>\"\",CHOOSE(WEEKDAY(AK83,1),\"Dom.\",\"Seg.\",\"Ter.\",\"Qua.\",\"Qui.\",\"Sex.\",\"Sáb.\"),\"\")","v":""}]
[{"$nulls":3},{"$f":"A82","v":"2024-05-01"},{"$f":"IF(D83=\"\",\"\",IF(DAY(D83)<DAY(EOMONTH(D83,0)),D83+1,\"\"))","v":"2024-05-02"},{"$f":"IF(E83=\"\",\"\",IF(DAY(E83)<DAY(EOMONTH(E83,0)),E83+1,\"\"))","v":"2024-05-03"},"2024-05-04","2024-05-05","2024-05-06","2024-05-07","2024-05-08","2024-05-09","2024-05-10","2024-05-11","2024-05-12","2024-05-13","2024-05-14","2024-05-15","2024-05-16","2024-05-17","2024-05-18","2024-05-19","2024-05-20","2024-05-21","2024-05-22","2024-05-23","2024-05-24","2024-05-25","2024-05-26","2024-05-27","2024-05-28","2024-05-29","2024-05-30","2024-05-31"]
[9,"-",10]
[10,"-",11,{"$nulls":14},"Caldas",{"$nulls":14},"Corpo"]
[11,"-",12,"Trabalh.",{"$nulls":13},"Rainha",{"$nulls":14},"Deus"]
[12,"-",13]
[]
[14,"-",15]
[15,"-",16]
[16,"-",17]
[17,"-",18]
[]
[19,"-",20]
[20,"-",21]
[21,"-",22]
[]
[]
[]
["2024-06-01",null,null,{"$f":"IF(D101<>\"\",CHOOSE(WEEKDAY(D101,1),\"Dom.\",\"Seg.\",\"Ter.\",\"Qua.\",\"Qui.\",\"Sex.\",\"Sáb.\"),\"\")","v":"Sáb."},{"$f":"IF(E101<>\"\",CHOOSE(WEEKDAY(E101,1),\"Dom.\",\"Seg.\",\"Ter.\",\"Qua.\",\"Qui.\",\"Sex.\",\"Sáb.\"),\"\")","v":"Dom."},"Seg.","Ter.","Qua.","Qui.","Sex.","Sáb.","Dom.","Seg.","Ter.","Qua.","Qui.","Sex.","Sáb.","Dom.","Seg.","Ter.","Qua.","Qui.","Sex.","Sáb.","Dom.","Seg.","Ter.","Qua.","Qui.","Sex.","Sáb.","Dom.",{"$nulls":3},{"$f":"IF(AK101<>\"\",CHOOSE(WEEKDAY(AK101,1),\"Dom.\",\"Seg.\",\"Ter.\",\"Qua.\",\"Qui.\",\"Sex.\",\"Sáb.\"),\"\")","v":""}]
[{"$nulls":3},{"$f":"A100","v":"2024-06-01"},{"$f":"IF(D101=\"\",\"\",IF(DAY(D101)<DAY(EOMONTH(D101,0)),D101+1,\"\"))","v":"2024-06-02"},{"$f":"IF(E101=\"\",\"\",IF(DAY(E101)<DAY(EOMONTH(E101,0)),E101+1,\"\"))","v":"2024-06-03"},"2024-06-04","2024-06-05","2024-06-06","2024-06-07","2024-06-08","2024-06-09","2024-06-10","2024-06-11","2024-06-12","2024-06-13","2024-06-14","2024-06-15","2024-06-16","2024-06-17","2024-06-18","2024-06-19","2024-06-20","2024-06-21","2024-06-22","2024-06-23","2024-06-24","2024-06-25","2024-06-26","2024-06-27","2024-06-28","2024-06-29","2024-06-30"]
[9,"-",10]
[10,"-",11]
[11,"-",12,{"$nulls":9},"Portugal"]
[12,"-",13]
[]
[14,"-",15]
[15,"-",16]
[16,"-",17]
[17,"-",18]
[]
[19,"-",20]
[20,"-",21]
[21,"-",22]
[]
[]
[]
["2024-07-01",null,null,{"$f":"IF(D119<>\"\",CHOOSE(WEEKDAY(D119,1),\"Dom.\",\"Seg.\",\"Ter.\",\"Qua.\",\"Qui.\",\"Sex.\",\"Sáb.\"),\"\")","v":"Seg."},{"$f":"IF(E119<>\"\",CHOOSE(WEEKDAY(E119,1),\"Dom.\",\"Seg.\",\"Ter.\",\"Qua.\",\"Qui.\",\"Sex.\",\"Sáb.\"),\"\")","v":"Ter."},"Qua.","Qui.","Sex.","Sáb.","Dom.","Seg.","Ter.","Qua.","Qui.","Sex.","Sáb.","Dom.","Seg.","Ter.","Qua.","Qui.","Sex.","Sáb.","Dom.","Seg.","Ter.","Qua.","Qui.","Sex.","Sáb.","Dom.","Seg.","Ter.","Qua.",null,null,{"$f":"IF(AK119<>\"\",CHOOSE(WEEKDAY(AK119,1),\"Dom.\",\"Seg.\",\"Ter.\",\"Qua.\",\"Qui.\",\"Sex.\",\"Sáb.\"),\"\")","v":""}]
[{"$nulls":3},{"$f":"A118","v":"2024-07-01"},{"$f":"IF(D119=\"\",\"\",IF(DAY(D119)<DAY(EOMONTH(D119,0)),D119+1,\"\"))","v":"2024-07-02"},{"$f":"IF(E119=\"\",\"\",IF(DAY(E119)<DAY(EOMONTH(E119,0)),E119+1,\"\"))","v":"2024-07-03"},"2024-07-04","2024-07-05","2024-07-06","2024-07-07","2024-07-08","2024-07-09","2024-07-10","2024-07-11","2024-07-12","2024-07-13","2024-07-14","2024-07-15","2024-07-16","2024-07-17","2024-07-18","2024-07-19","2024-07-20","2024-07-21","2024-07-22","2024-07-23","2024-07-24","2024-07-25","2024-07-26","2024-07-27","2024-07-28","2024-07-29","2024-07-30","2024-07-31"]
[9,"-",10]
[10,"-",11]
[11,"-",12]
[12,"-",13]
[]
[14,"-",15]
[15,"-",16]
[16,"-",17]
[17,"-",18]
[]
[19,"-",20]
[20,"-",21]
[21,"-",22]
[]
[]
[{"$nulls":32},"V. Caetano"]
["2024-08-01",null,null,{"$f":"IF(D137<>\"\",CHOOSE(WEEKDAY(D137,1),\"Dom.\",\"Seg.\",\"Ter.\",\"Qua.\",\"Qui.\",\"Sex.\",\"Sáb.\"),\"\")","v":"Qui."},{"$f":"IF(E137<>\"\",CHOOSE(WEEKDAY(E137,1),\"Dom.\",\"Seg.\",\"Ter.\",\"Qua.\",\"Qui.\",\"Sex.\",\"Sáb.\"),\"\")","v":"Sex."},"Sáb.","Dom.","Seg.","Ter.","Qua.","Qui.","Sex.","Sáb.","Dom.","Seg.","Ter.","Qua.","Qui.","Sex.","Sáb.","Dom.","Seg.","Ter.","Qua.","Qui.","Sex.","Sáb.","Dom.","Seg.","Ter.","Qua.","Qui.","Sex.","Sáb.",null,null,{"$f":"IF(AK137<>\"\",CHOOSE(WEEKDAY(AK137,1),\"Dom.\",\"Seg.\",\"Ter.\",\"Qua.\",\"Qui.\",\"Sex.\",\"Sáb.\"),\"\")","v":""}]
[{"$nulls":3},{"$f":"A136","v":"2024-08-01"},{"$f":"IF(D137=\"\",\"\",IF(DAY(D137)<DAY(EOMONTH(D137,0)),D137+1,\"\"))","v":"2024-08-02"},{"$f":"IF(E137=\"\",\"\",IF(DAY(E137)<DAY(EOMONTH(E137,0)),E137+1,\"\"))","v":"2024-08-03"},"2024-08-04","2024-08-05","2024-08-06","2024-08-07","2024-08-08","2024-08-09","2024-08-10","2024-08-11","2024-08-12","2024-08-13","2024-08-14","2024-08-15","2024-08-16","2024-08-17","2024-08-18","2024-08-19","2024-08-20","2024-08-21","2024-08-22","2024-08-23","2024-08-24","2024-08-25","2024-08-26","2024-08-27","2024-08-28","2024-08-29","2024-08-30","2024-08-31"]
[9,"-",10]
[10,"-",11,{"$nulls":14},"Assunção"]
[11,"-",12,{"$nulls":14},"Nossa"]
[12,"-",13,{"$nulls":14},"Senhora"]
[]
[14,"-",15]
[15,"-",16]
[16,"-",17]
[17,"-",18]
[]
[19,"-",20]
[20,"-",21]
[21,"-",22]
[]
[]
[]
["2024-09-01",null,null,{"$f":"IF(D155<>\"\",CHOOSE(WEEKDAY(D155,1),\"Dom.\",\"Seg.\",\"Ter.\",\"Qua.\",\"Qui.\",\"Sex.\",\"Sáb.\"),\"\")","v":"Dom."},{"$f":"IF(E155<>\"\",CHOOSE(WEEKDAY(E155,1),\"Dom.\",\"Seg.\",\"Ter.\",\"Qua.\",\"Qui.\",\"Sex.\",\"Sáb.\"),\"\")","v":"Seg."},"Ter.","Qua.","Qui.","Sex.","Sáb.","Dom.","Seg.","Ter.","Qua.","Qui.","Sex.","Sáb.","Dom.","Seg.","Ter.","Qua.","Qui.","Sex.","Sáb.","Dom.","Seg.","Ter.","Qua.","Qui.","Sex.","Sáb.","Dom.","Seg.",{"$nulls":3},{"$f":"IF(AK155<>\"\",CHOOSE(WEEKDAY(AK155,1),\"Dom.\",\"Seg.\",\"Ter.\",\"Qua.\",\"Qui.\",\"Sex.\",\"Sáb.\"),\"\")","v":""}]
[{"$nulls":3},{"$f":"A154","v":"2024-09-01"},{"$f":"IF(D155=\"\",\"\",IF(DAY(D155)<DAY(EOMONTH(D155,0)),D155+1,\"\"))","v":"2024-09-02"},{"$f":"IF(E155=\"\",\"\",IF(DAY(E155)<DAY(EOMONTH(E155,0)),E155+1,\"\"))","v":"2024-09-03"},"2024-09-04","2024-09-05","2024-09-06","2024-09-07","2024-09-08","2024-09-09","2024-09-10","2024-09-11","2024-09-12","2024-09-13","2024-09-14","2024-09-15","2024-09-16","2024-09-17","2024-09-18","2024-09-19","2024-09-20","2024-09-21","2024-09-22","2024-09-23","2024-09-24","2024-09-25","2024-09-26","2024-09-27","2024-09-28","2024-09-29","2024-09-30"]
[9,"-",10]
[10,"-",11]
[11,"-",12]
[12,"-",13]
[]
[14,"-",15]
[15,"-",16]
[16,"-",17]
[17,"-",18]
[]
[19,"-",20]
[20,"-",21]
[21,"-",22]
[]
[]
[]
["2024-10-01",null,null,{"$f":"IF(D173<>\"\",CHOOSE(WEEKDAY(D173,1),\"Dom.\",\"Seg.\",\"Ter.\",\"Qua.\",\"Qui.\",\"Sex.\",\"Sáb.\"),\"\")","v":"Ter."},{"$f":"IF(E173<>\"\",CHOOSE(WEEKDAY(E173,1),\"Dom.\",\"Seg.\",\"Ter.\",\"Qua.\",\"Qui.\",\"Sex.\",\"Sáb.\"),\"\")","v":"Qua."},"Qui.","Sex.","Sáb.","Dom.","Seg.","Ter.","Qua.","Qui.","Sex.","Sáb.","Dom.","Seg.","Ter.","Qua.","Qui.","Sex.","Sáb.","Dom.","Seg.","Ter.","Qua.","Qui.","Sex.","Sáb.","Dom.","Seg.","Ter.","Qua.","Qui.",null,null,{"$f":"IF(AK173<>\"\",CHOOSE(WEEKDAY(AK173,1),\"Dom.\",\"Seg.\",\"Ter.\",\"Qua.\",\"Qui.\",\"Sex.\",\"Sáb.\"),\"\")","v":""}]
[{"$nulls":3},{"$f":"A172","v":"2024-10-01"},{"$f":"IF(D173=\"\",\"\",IF(DAY(D173)<DAY(EOMONTH(D173,0)),D173+1,\"\"))","v":"2024-10-02"},{"$f":"IF(E173=\"\",\"\",IF(DAY(E173)<DAY(EOMONTH(E173,0)),E173+1,\"\"))","v":"2024-10-03"},"2024-10-04","2024-10-05","2024-10-06","2024-10-07","2024-10-08","2024-10-09","2024-10-10","2024-10-11","2024-10-12","2024-10-13","2024-10-14","2024-10-15","2024-10-16","2024-10-17","2024-10-18","2024-10-19","2024-10-20","2024-10-21","2024-10-22","2024-10-23","2024-10-24","2024-10-25","2024-10-26","2024-10-27","2024-10-28","2024-10-29","2024-10-30","2024-10-31"]
[9,"-",10]
[10,"-",11]
[11,"-",12,{"$nulls":4},"Repúb."]
[12,"-",13]
[]
[14,"-",15]
[15,"-",16]
[16,"-",17]
[17,"-",18]
[]
[19,"-",20]
[20,"-",21]
[21,"-",22]
[]
[]
[{"$nulls":32},"V. Caetano"]
["2024-11-01",null,null,{"$f":"IF(D191<>\"\",CHOOSE(WEEKDAY(D191,1),\"Dom.\",\"Seg.\",\"Ter.\",\"Qua.\",\"Qui.\",\"Sex.\",\"Sáb.\"),\"\")","v":"Sex."},{"$f":"IF(E191<>\"\",CHOOSE(WEEKDAY(E191,1),\"Dom.\",\"Seg.\",\"Ter.\",\"Qua.\",\"Qui.\",\"Sex.\",\"Sáb.\"),\"\")","v":"Sáb."},"Dom.","Seg.","Ter.","Qua.","Qui.","Sex.","Sáb.","Dom.","Seg.","Ter.","Qua.","Qui.","Sex.","Sáb.","Dom.","Seg.","Ter.","Qua.","Qui.","Sex.","Sáb.","Dom.","Seg.","Ter.","Qua.","Qui.","Sex.","Sáb.",{"$nulls":3},{"$f":"IF(AK191<>\"\",CHOOSE(WEEKDAY(AK191,1),\"Dom.\",\"Seg.\",\"Ter.\",\"Qua.\",\"Qui.\",\"Sex.\",\"Sáb.\"),\"\")","v":""}]
[{"$nulls":3},{"$f":"A190","v":"2024-11-01"},{"$f":"IF(D191=\"\",\"\",IF(DAY(D191)<DAY(EOMONTH(D191,0)),D191+1,\"\"))","v":"2024-11-02"},{"$f":"IF(E191=\"\",\"\",IF(DAY(E191)<DAY(EOMONTH(E191,0)),E191+1,\"\"))","v":"2024-11-03"},"2024-11-04","2024-11-05","2024-11-06","2024-11-07","2024-11-08","2024-11-09","2024-11-10","2024-11-11","2024-11-12","2024-11-13","2024-11-14","2024-11-15","2024-11-16","2024-11-17","2024-11-18","2024-11-19","2024-11-20","2024-11-21","2024-11-22","2024-11-23","2024-11-24","2024-11-25","2024-11-26","2024-11-27","2024-11-28","2024-11-29","2024-11-30"]
[9,"-",10]
[10,"-",11,"Todos",{"$nulls":9},"São"]
[11,"-",12,"Santos",{"$nulls":9},"Martinho"]
[12,"-",13]
[]
[14,"-",15]
[15,"-",16,{"$nulls":10},"Torres"]
[16,"-",17,{"$nulls":10},"Vedras"]
[17,"-",18]
[]
[19,"-",20]
[20,"-",21]
[21,"-",22]
[]
[]
[]
["2024-12-01",null,null,{"$f":"IF(D209<>\"\",CHOOSE(WEEKDAY(D209,1),\"Dom.\",\"Seg.\",\"Ter.\",\"Qua.\",\"Qui.\",\"Sex.\",\"Sáb.\"),\"\")","v":"Dom."},{"$f":"IF(E209<>\"\",CHOOSE(WEEKDAY(E209,1),\"Dom.\",\"Seg.\",\"Ter.\",\"Qua.\",\"Qui.\",\"Sex.\",\"Sáb.\"),\"\")","v":"Seg."},"Ter.","Qua.","Qui.","Sex.","Sáb.","Dom.","Seg.","Ter.","Qua.","Qui.","Sex.","Sáb.","Dom.","Seg.","Ter.","Qua.","Qui.","Sex.","Sáb.","Dom.","Seg.","Ter.","Qua.","Qui.","Sex.","Sáb.","Dom.","Seg.","Ter.",null,null,{"$f":"IF(AK209<>\"\",CHOOSE(WEEKDAY(AK209,1),\"Dom.\",\"Seg.\",\"Ter.\",\"Qua.\",\"Qui.\",\"Sex.\",\"Sáb.\"),\"\")","v":""}]
[{"$nulls":3},{"$f":"A208","v":"2024-12-01"},{"$f":"IF(D209=\"\",\"\",IF(DAY(D209)<DAY(EOMONTH(D209,0)),D209+1,\"\"))","v":"2024-12-02"},{"$f":"IF(E209=\"\",\"\",IF(DAY(E209)<DAY(EOMONTH(E209,0)),E209+1,\"\"))","v":"2024-12-03"},"2024-12-04","2024-12-05","2024-12-06","2024-12-07","2024-12-08","2024-12-09","2024-12-10","2024-12-11","2024-12-12","2024-12-13","2024-12-14","2024-12-15","2024-12-16","2024-12-17","2024-12-18","2024-12-19","2024-12-20","2024-12-21","2024-12-22","2024-12-23","2024-12-24","2024-12-25","2024-12-26","2024-12-27","2024-12-28","2024-12-29","2024-12-30","2024-12-31"]
[9,"-",10]
[10,"-",11,"Rest.",{"$nulls":6},"Imacu."]
[11,"-",12,"Indep.",{"$nulls":6},"Concei.",{"$nulls":16},"NATAL"]
[12,"-",13]
[]
[14,"-",15]
[15,"-",16]
[16,"-",17]
[17,"-",18]
[]
[19,"-",20]
[20,"-",21]
[21,"-",22]

{"sheet":"2025","index":2,"n_rows":222,"n_cols":40,"rows_kept":222,"merged":[[1,0,1,2],[1,3,1,4],[2,0,2,2],[2,3,2,4],[9,0,10,2],[26,32,26,33],[27,0,28,2],[44,32,44,33],[45,0,46,2],[62,32,62,33],[63,0,64,2],[80,32,80,33],[81,0,82,2],[98,32,98,33],[99,0,100,2],[116,32,116,33],[117,0,118,2],[134,32,134,33],[135,0,136,2],[152,32,152,33],[153,0,154,2],[170,32,170,33],[171,0,172,2],[188,32,188,33],[189,0,190,2],[206,32,206,33],[207,0,208,2],[224,32,224,33]]}
[{"$nulls":12},13,14,15,16,17,18,19,20,21,22,23,{"$nulls":6},30,{"$nulls":3},34,35,{"$nulls":4},"Feriados"]
["D. de Início:",null,null,"2025-01-01",{"$nulls":35},"2013-01-01"]
["Nº de Meses:",null,null,12,{"$nulls":8},"Ano",null,"Horas",null,"Semana","Dias",null,"Fundo","Grelha","Inter.","Base"]
[]
[]
[{"$nulls":39},"2013-04-25"]
[{"$nulls":39},"2013-05-01"]
[{"$nulls":39},"2013-06-10"]
[]
[{"$f":"EOMONTH(D2,-1)+1","v":"2025-01-01"},null,null,{"$f":"IF(D11<>\"\",CHOOSE(WEEKDAY(D11,1),\"Dom.\",\"Seg.\",\"Ter.\",\"Qua.\",\"Qui.\",\"Sex.\",\"Sáb.\"),\"\")","v":"Qua."},{"$f":"IF(E11<>\"\",CHOOSE(WEEKDAY(E11,1),\"Dom.\",\"Seg.\",\"Ter.\",\"Qua.\",\"Qui.\",\"Sex.\",\"Sáb.\"),\"\")","v":"Qui."},"Sex.","Sáb.","Dom.","Seg.","Ter.","Qua.","Qui.","Sex.","Sáb.","Dom.","Seg.","Ter.","Qua.","Qui.","Sex.","Sáb.","Dom.","Seg.","Ter.","Qua.","Qui.","Sex.","Sáb.","Dom.","Seg.","Ter.","Qua.","Qui.","Sex.",{"$nulls":5},"2010-08-15"]
[{"$nulls":3},{"$f":"A10","v":"2025-01-01"},{"$f":"IF(D11=\"\",\"\",IF(DAY(D11)<DAY(EOMONTH(D11,0)),D11+1,\"\"))","v":"2025-01-02"},{"$f":"IF(E11=\"\",\"\",IF(DAY(E11)<DAY(EOMONTH(E11,0)),E11+1,\"\"))","v":"2025-01-03"},"2025-01-04","2025-01-05","2025-01-06","2025-01-07","2025-01-08","2025-01-09","2025-01-10","2025-01-11","2025-01-12","2025-01-13","2025-01-14","2025-01-15","2025-01-16","2025-01-17","2025-01-18","2025-01-19","2025-01-20","2025-01-21","2025-01-22","2025-01-23","2025-01-24","2025-01-25","2025-01-26","2025-01-27","2025-01-28","2025-01-29","2025-01-30","2025-01-31"]
[9,"-",10]
[10,"-",11,"Ano"]
[11,"-",12,"Novo",{"$nulls":35},"2010-12-08"]
[12,"-",13,{"$nulls":36},"2013-12-25"]
[]
[14,"-",15,{"$nulls":36},0]
[15,"-",16]
[16,"-",17]
[17,"-",18]
[]
[19,"-",20]
[20,"-",21]
[21,"-",22]
[]
[]
[]
["2025-02-01",null,null,{"$f":"IF(D29<>\"\",CHOOSE(WEEKDAY(D29,1),\"Dom.\",\"Seg.\",\"Ter.\",\"Qua.\",\"Qui.\",\"Sex.\",\"Sáb.\"),\"\")","v":"Sáb."},{"$f":"IF(E29<>\"\",CHOOSE(WEEKDAY(E29,1),\"Dom.\",\"Seg.\",\"Ter.\",\"Qua.\",\"Qui.\",\"Sex.\",\"Sáb.\"),\"\")","v":"Dom."},"Seg.","Ter.","Qua.","Qui.","Sex.","Sáb.","Dom.","Seg.","Ter.","Qua.","Qui.","Sex.","Sáb.","Dom.","Seg.","Ter.","Qua.","Qui.","Sex.","Sáb.","Dom.","Seg.","Ter.","Qua.","Qui.","Sex."]
[{"$nulls":3},{"$f":"A28","v":"2025-02-01"},{"$f":"IF(D29=\"\",\"\",IF(DAY(D29)<DAY(EOMONTH(D29,0)),D29+1,\"\"))","v":"2025-02-02"},{"$f":"IF(E29=\"\",\"\",IF(DAY(E29)<DAY(EOMONTH(E29,0)),E29+1,\"\"))","v":"2025-02-03"},"2025-02-04","2025-02-05","2025-02-06","2025-02-07","2025-02-08","2025-02-09","2025-02-10","2025-02-11","2025-02-12","2025-02-13","2025-02-14","2025-02-15","2025-02-16","2025-02-17","2025-02-18","2025-02-19","2025-02-20","2025-02-21","2025-02-22","2025-02-23","2025-02-24","2025-02-25","2025-02-26","2025-02-27","2025-02-28"]
[9,"-",10]
[10,"-",11]
[11,"-",12]
[12,"-",13]
[]
[14,"-",15]
[15,"-",16]
[16,"-",17]
[17,"-",18]
[]
[19,"-",20]
[20,"-",21]
[21,"-",22]
[]
[]
[]
["2025-03-01",null,null,{"$f":"IF(D47<>\"\",CHOOSE(WEEKDAY(D47,1),\"Dom.\",\"Seg.\",\"Ter.\",\"Qua.\",\"Qui.\",\"Sex.\",\"Sáb.\"),\"\")","v":"Sáb."},{"$f":"IF(E47<>\"\",CHOOSE(WEEKDAY(E47,1),\"Dom.\",\"Seg.\",\"Ter.\",\"Qua.\",\"Qui.\",\"Sex.\",\"Sáb.\"),\"\")","v":"Dom."},"Seg.","Ter.","Qua.","Qui.","Sex.","Sáb.","Dom.","Seg.","Ter.","Qua.","Qui.","Sex.","Sáb.","Dom.","Seg.","Ter.","Qua.","Qui.","Sex.","Sáb.","Dom.","Seg.","Ter.","Qua.","Qui.","Sex.","Sáb.","Dom.","Seg.",null,null,{"$f":"IF(AK47<>\"\",CHOOSE(WEEKDAY(AK47,1),\"Dom.\",\"Seg.\",\"Ter.\",\"Qua.\",\"Qui.\",\"Sex.\",\"Sáb.\"),\"\")","v":""}]
[{"$nulls":3},{"$f":"A46","v":"2025-03-01"},{"$f":"IF(D47=\"\",\"\",IF(DAY(D47)<DAY(EOMONTH(D47,0)),D47+1,\"\"))","v":"2025-03-02"},{"$f":"IF(E47=\"\",\"\",IF(DAY(E47)<DAY(EOMONTH(E47,0)),E47+1,\"\"))","v":"2025-03-03"},"2025-03-04","2025-03-05","2025-03-06","2025-03-07","2025-03-08","2025-03-09","2025-03-10","2025-03-11","2025-03-12","2025-03-13","2025-03-14","2025-03-15","2025-03-16","2025-03-17","2025-03-18","2025-03-19","2025-03-20","2025-03-21","2025-03-22","2025-03-23","2025-03-24","2025-03-25","2025-03-26","2025-03-27","2025-03-28","2025-03-29","2025-03-30","2025-03-31"]
[9,"-",10]
[10,"-",11]
[11,"-",12,{"$nulls":3},"Entrudo"]
[12,"-",13]
[]
[14,"-",15]
[15,"-",16]
[16,"-",17]
[17,"-",18]
[]
[19,"-",20]
[20,"-",21]
[21,"-",22]
[]
[]
[{"$nulls":32},"V. Caetano"]
["2025-04-01",null,null,{"$f":"IF(D65<>\"\",CHOOSE(WEEKDAY(D65,1),\"Dom.\",\"Seg.\",\"Ter.\",\"Qua.\",\"Qui.\",\"Sex.\",\"Sáb.\"),\"\")","v":"Ter."},{"$f":"IF(E65<>\"\",CHOOSE(WEEKDAY(E65,1),\"Dom.\",\"Seg.\",\"Ter.\",\"Qua.\",\"Qui.\",\"Sex.\",\"Sáb.\"),\"\")","v":"Qua."},"Qui.","Sex.","Sáb.","Dom.","Seg.","Ter.","Qua.","Qui.","Sex.","Sáb.","Dom.","Seg.","Ter.","Qua.","Qui.","Sex.","Sáb.","Dom.","Seg.","Ter.","Qua.","Qui.","Sex.","Sáb.","Dom.","Seg.","Ter.","Qua.",{"$nulls":3},{"$f":"IF(AK65<>\"\",CHOOSE(WEEKDAY(AK65,1),\"Dom.\",\"Seg.\",\"Ter.\",\"Qua.\",\"Qui.\",\"Sex.\",\"Sáb.\"),\"\")","v":""}]
[{"$nulls":3},{"$f":"A64","v":"2025-04-01"},{"$f":"IF(D65=\"\",\"\",IF(DAY(D65)<DAY(EOMONTH(D65,0)),D65+1,\"\"))","v":"2025-04-02"},{"$f":"IF(E65=\"\",\"\",IF(DAY(E65)<DAY(EOMONTH(E65,0)),E65+1,\"\"))","v":"2025-04-03"},"2025-04-04","2025-04-05","2025-04-06","2025-04-07","2025-04-08","2025-04-09","2025-04-10","2025-04-11","2025-04-12","2025-04-13","2025-04-14","2025-04-15","2025-04-16","2025-04-17","2025-04-18","2025-04-19","2025-04-20","2025-04-21","2025-04-22","2025-04-23","2025-04-24","2025-04-25","2025-04-26","2025-04-27","2025-04-28","2025-04-29","2025-04-30"]
[9,"-",10]
[10,"-",11,{"$nulls":17},"Sexta"]
[11,"-",12,{"$nulls":17},"Santa",null,"Páscoa",{"$nulls":4},"Liberd."]
[12,"-",13]
[]
[14,"-",15]
[15,"-",16]
[16,"-",17]
[17,"-",18]
[]
[19,"-",20]
[20,"-",21]
[21,"-",22]
[]
[]
[]
["2025-05-01",null,null,{"$f":"IF(D83<>\"\",CHOOSE(WEEKDAY(D83,1),\"Dom.\",\"Seg.\",\"Ter.\",\"Qua.\",\"Qui.\",\"Sex.\",\"Sáb.\"),\"\")","v":"Qui."},{"$f":"IF(E83<>\"\",CHOOSE(WEEKDAY(E83,1),\"Dom.\",\"Seg.\",\"Ter.\",\"Qua.\",\"Qui.\",\"Sex.\",\"Sáb.\"),\"\")","v":"Sex."},"Sáb.","Dom.","Seg.","Ter.","Qua.","Qui.","Sex.","Sáb.","Dom.","Seg.","Ter.","Qua.","Qui.","Sex.","Sáb.","Dom.","Seg.","Ter.","Qua.","Qui.","Sex.","Sáb.","Dom.","Seg.","Ter.","Qua.","Qui.","Sex.","Sáb.",null,null,{"$f":"IF(AK83<>\"\",CHOOSE(WEEKDAY(AK83,1),\"Dom.\",\"Seg.\",\"Ter.\",\"Qua.\",\"Qui.\",\"Sex.\",\"Sáb.\"),\"\")","v":""}]
[{"$nulls":3},{"$f":"A82","v":"2025-05-01"},{"$f":"IF(D83=\"\",\"\",IF(DAY(D83)<DAY(EOMONTH(D83,0)),D83+1,\"\"))","v":"2025-05-02"},{"$f":"IF(E83=\"\",\"\",IF(DAY(E83)<DAY(EOMONTH(E83,0)),E83+1,\"\"))","v":"2025-05-03"},"2025-05-04","2025-05-05","2025-05-06","2025-05-07","2025-05-08","2025-05-09","2025-05-10","2025-05-11","2025-05-12","2025-05-13","2025-05-14","2025-05-15","2025-05-16","2025-05-17","2025-05-18","2025-05-19","2025-05-20","2025-05-21","2025-05-22","2025-05-23","2025-05-24","2025-05-25","2025-05-26","2025-05-27","2025-05-28","2025-05-29","2025-05-30","2025-05-31"]
[9,"-",10]
[10,"-",11,{"$nulls":14},"Caldas"]
[11,"-",12,"Trabalh.",{"$nulls":13},"Rainha"]
[12,"-",13]
[]
[14,"-",15]
[15,"-",16]
[16,"-",17]
[17,"-",18]
[]
[19,"-",20]
[20,"-",21]
[21,"-",22]
[]
[]
[]
["2025-06-01",null,null,{"$f":"IF(D101<>\"\",CHOOSE(WEEKDAY(D101,1),\"Dom.\",\"Seg.\",\"Ter.\",\"Qua.\",\"Qui.\",\"Sex.\",\"Sáb.\"),\"\")","v":"Dom."},{"$f":"IF(E101<>\"\",CHOOSE(WEEKDAY(E101,1),\"Dom.\",\"Seg.\",\"Ter.\",\"Qua.\",\"Qui.\",\"Sex.\",\"Sáb.\"),\"\")","v":"Seg."},"Ter.","Qua.","Qui.","Sex.","Sáb.","Dom.","Seg.","Ter.","Qua.","Qui.","Sex.","Sáb.","Dom.","Seg.","Ter.","Qua.","Qui.","Sex.","Sáb.","Dom.","Seg.","Ter.","Qua.","Qui.","Sex.","Sáb.","Dom.","Seg.",{"$nulls":3},{"$f":"IF(AK101<>\"\",CHOOSE(WEEKDAY(AK101,1),\"Dom.\",\"Seg.\",\"Ter.\",\"Qua.\",\"Qui.\",\"Sex.\",\"Sáb.\"),\"\")","v":""}]
[{"$nulls":3},{"$f":"A100","v":"2025-06-01"},{"$f":"IF(D101=\"\",\"\",IF(DAY(D101)<DAY(EOMONTH(D101,0)),D101+1,\"\"))","v":"2025-06-02"},{"$f":"IF(E101=\"\",\"\",IF(DAY(E101)<DAY(EOMONTH(E101,0)),E101+1,\"\"))","v":"2025-06-03"},"2025-06-04","2025-06-05","2025-06-06","2025-06-07","2025-06-08","2025-06-09","2025-06-10","2025-06-11","2025-06-12","2025-06-13","2025-06-14","2025-06-15","2025-06-16","2025-06-17","2025-06-18","2025-06-19","2025-06-20","2025-06-21","2025-06-22","2025-06-23","2025-06-24","2025-06-25","2025-06-26","2025-06-27","2025-06-28","2025-06-29","2025-06-30"]
[9,"-",10]
[10,"-",11,{"$nulls":18},"Corpo"]
[11,"-",12,{"$nulls":9},"Portugal",{"$nulls":8},"Deus"]
[12,"-",13]
[]
[14,"-",15]
[15,"-",16]
[16,"-",17]
[17,"-",18]
[]
[19,"-",20]
[20,"-",21]
[21,"-",22]
[]
[]
[]
["2025-07-01",null,null,{"$f":"IF(D119<>\"\",CHOOSE(WEEKDAY(D119,1),\"Dom.\",\"Seg.\",\"Ter.\",\"Qua.\",\"Qui.\",\"Sex.\",\"Sáb.\"),\"\")","v":"Ter."},{"$f":"IF(E119<>\"\",CHOOSE(WEEKDAY(E119,1),\"Dom.\",\"Seg.\",\"Ter.\",\"Qua.\",\"Qui.\",\"Sex.\",\"Sáb.\"),\"\")","v":"Qua."},"Qui.","Sex.","Sáb.","Dom.","Seg.","Ter.","Qua.","Qui.","Sex.","Sáb.","Dom.","Seg.","Ter.","Qua.","Qui.","Sex.","Sáb.","Dom.","Seg.","Ter.","Qua.","Qui.","Sex.","Sáb.","Dom.","Seg.","Ter.","Qua.","Qui.",null,null,{"$f":"IF(AK119<>\"\",CHOOSE(WEEKDAY(AK119,1),\"Dom.\",\"Seg.\",\"Ter.\",\"Qua.\",\"Qui.\",\"Sex.\",\"Sáb.\"),\"\")","v":""}]
[{"$nulls":3},{"$f":"A118","v":"2025-07-01"},{"$f":"IF(D119=\"\",\"\",IF(DAY(D119)<DAY(EOMONTH(D119,0)),D119+1,\"\"))","v":"2025-07-02"},{"$f":"IF(E119=\"\",\"\",IF(DAY(E119)<DAY(EOMONTH(E119,0)),E119+1,\"\"))","v":"2025-07-03"},"2025-07-04","2025-07-05","2025-07-06","2025-07-07","2025-07-08","2025-07-09","2025-07-10","2025-07-11","2025-07-12","2025-07-13","2025-07-14","2025-07-15","2025-07-16","2025-07-17","2025-07-18","2025-07-19","2025-07-20","2025-07-21","2025-07-22","2025-07-23","2025-07-24","2025-07-25","2025-07-26","2025-07-27","2025-07-28","2025-07-29","2025-07-30","2025-07-31"]
[9,"-",10]
[10,"-",11]
[11,"-",12]
[12,"-",13]
[]
[14,"-",15]
[15,"-",16]
[16,"-",17]
[17,"-",18]
[]
[19,"-",20]
[20,"-",21]
[21,"-",22]
[]
[]
[{"$nulls":32},"V. Caetano"]
["2025-08-01",null,null,{"$f":"IF(D137<>\"\",CHOOSE(WEEKDAY(D137,1),\"Dom.\",\"Seg.\",\"Ter.\",\"Qua.\",\"Qui.\",\"Sex.\",\"Sáb.\"),\"\")","v":"Sex."},{"$f":"IF(E137<>\"\",CHOOSE(WEEKDAY(E137,1),\"Dom.\",\"Seg.\",\"Ter.\",\"Qua.\",\"Qui.\",\"Sex.\",\"Sáb.\"),\"\")","v":"Sáb."},"Dom.","Seg.","Ter.","Qua.","Qui.","Sex.","Sáb.","Dom.","Seg.","Ter.","Qua.","Qui.","Sex.","Sáb.","Dom.","Seg.","Ter.","Qua.","Qui.","Sex.","Sáb.","Dom.","Seg.","Ter.","Qua.","Qui.","Sex.","Sáb.","Dom.",null,null,{"$f":"IF(AK137<>\"\",CHOOSE(WEEKDAY(AK137,1),\"Dom.\",\"Seg.\",\"Ter.\",\"Qua.\",\"Qui.\",\"Sex.\",\"Sáb.\"),\"\")","v":""}]
[{"$nulls":3},{"$f":"A136","v":"2025-08-01"},{"$f":"IF(D137=\"\",\"\",IF(DAY(D137)<DAY(EOMONTH(D137,0)),D137+1,\"\"))","v":"2025-08-02"},{"$f":"IF(E137=\"\",\"\",IF(DAY(E137)<DAY(EOMONTH(E137,0)),E137+1,\"\"))","v":"2025-08-03"},"2025-08-04","2025-08-05","2025-08-06","2025-08-07","2025-08-08","2025-08-09","2025-08-10","2025-08-11","2025-08-12","2025-08-13","2025-08-14","2025-08-15","2025-08-16","2025-08-17","2025-08-18","2025-08-19","2025-08-20","2025-08-21","2025-08-22","2025-08-23","2025-08-24","2025-08-25","2025-08-26","2025-08-27","2025-08-28","2025-08-29","2025-08-30","2025-08-31"]
[9,"-",10]
[10,"-",11,{"$nulls":14},"Assunção"]
[11,"-",12,{"$nulls":14},"Nossa"]
[12,"-",13,{"$nulls":14},"Senhora"]
[]
[14,"-",15]
[15,"-",16]
[16,"-",17]
[17,"-",18]
[]
[19,"-",20]
[20,"-",21]
[21,"-",22]
[]
[]
[]
["2025-09-01",null,null,{"$f":"IF(D155<>\"\",CHOOSE(WEEKDAY(D155,1),\"Dom.\",\"Seg.\",\"Ter.\",\"Qua.\",\"Qui.\",\"Sex.\",\"Sáb.\"),\"\")","v":"Seg."},{"$f":"IF(E155<>\"\",CHOOSE(WEEKDAY(E155,1),\"Dom.\",\"Seg.\",\"Ter.\",\"Qua.\",\"Qui.\",\"Sex.\",\"Sáb.\"),\"\")","v":"Ter."},"Qua.","Qui.","Sex.","Sáb.","Dom.","Seg.","Ter.","Qua.","Qui.","Sex.","Sáb.","Dom.","Seg.","Ter.","Qua.","Qui.","Sex.","Sáb.","Dom.","Seg.","Ter.","Qua.","Qui.","Sex.","Sáb.","Dom.","Seg.","Ter.",{"$nulls":3},{"$f":"IF(AK155<>\"\",CHOOSE(WEEKDAY(AK155,1),\"Dom.\",\"Seg.\",\"Ter.\",\"Qua.\",\"Qui.\",\"Sex.\",\"Sáb.\"),\"\")","v":""}]
[{"$nulls":3},{"$f":"A154","v":"2025-09-01"},{"$f":"IF(D155=\"\",\"\",IF(DAY(D155)<DAY(EOMONTH(D155,0)),D155+1,\"\"))","v":"2025-09-02"},{"$f":"IF(E155=\"\",\"\",IF(DAY(E155)<DAY(EOMONTH(E155,0)),E155+1,\"\"))","v":"2025-09-03"},"2025-09-04","2025-09-05","2025-09-06","2025-09-07","2025-09-08","2025-09-09","2025-09-10","2025-09-11","2025-09-12","2025-09-13","2025-09-14","2025-09-15","2025-09-16","2025-09-17","2025-09-18","2025-09-19","2025-09-20","2025-09-21","2025-09-22","2025-09-23","2025-09-24","2025-09-25","2025-09-26","2025-09-27","2025-09-28","2025-09-29","2025-09-30"]
[9,"-",10]
[10,"-",11]
[11,"-",12]
[12,"-",13]
[]
[14,"-",15]
[15,"-",16]
[16,"-",17]
[17,"-",18]
[]
[19,"-",20]
[20,"-",21]
[21,"-",22]
[]
[]
[]
["2025-10-01",null,null,{"$f":"IF(D173<>\"\",CHOOSE(WEEKDAY(D173,1),\"Dom.\",\"Seg.\",\"Ter.\",\"Qua.\",\"Qui.\",\"Sex.\",\"Sáb.\"),\"\")","v":"Qua."},{"$f":"IF(E173<>\"\",CHOOSE(WEEKDAY(E173,1),\"Dom.\",\"Seg.\",\"Ter.\",\"Qua.\",\"Qui.\",\"Sex.\",\"Sáb.\"),\"\")","v":"Qui."},"Sex.","Sáb.","Dom.","Seg.","Ter.","Qua.","Qui.","Sex.","Sáb.","Dom.","Seg.","Ter.","Qua.","Qui.","Sex.","Sáb.","Dom.","Seg.","Ter.","Qua.","Qui.","Sex.","Sáb.","Dom.","Seg.","Ter.","Qua.","Qui.","Sex.",null,null,{"$f":"IF(AK173<>\"\",CHOOSE(WEEKDAY(AK173,1),\"Dom.\",\"Seg.\",\"Ter.\",\"Qua.\",\"Qui.\",\"Sex.\",\"Sáb.\"),\"\")","v":""}]
[{"$nulls":3},{"$f":"A172","v":"2025-10-01"},{"$f":"IF(D173=\"\",\"\",IF(DAY(D173)<DAY(EOMONTH(D173,0)),D173+1,\"\"))","v":"2025-10-02"},{"$f":"IF(E173=\"\",\"\",IF(DAY(E173)<DAY(EOMONTH(E173,0)),E173+1,\"\"))","v":"2025-10-03"},"2025-10-04","2025-10-05","2025-10-06","2025-10-07","2025-10-08","2025-10-09","2025-10-10","2025-10-11","2025-10-12","2025-10-13","2025-10-14","2025-10-15","2025-10-16","2025-10-17","2025-10-18","2025-10-19","2025-10-20","2025-10-21","2025-10-22","2025-10-23","2025-10-24","2025-10-25","2025-10-26","2025-10-27","2025-10-28","2025-10-29","2025-10-30","2025-10-31"]
[9,"-",10]
[10,"-",11]
[11,"-",12,{"$nulls":4},"Repúb."]
[12,"-",13]
[]
[14,"-",15]
[15,"-",16]
[16,"-",17]
[17,"-",18]
[]
[19,"-",20]
[20,"-",21]
[21,"-",22]
[]
[]
[{"$nulls":32},"V. Caetano"]
["2025-11-01",null,null,{"$f":"IF(D191<>\"\",CHOOSE(WEEKDAY(D191,1),\"Dom.\",\"Seg.\",\"Ter.\",\"Qua.\",\"Qui.\",\"Sex.\",\"Sáb.\"),\"\")","v":"Sáb."},{"$f":"IF(E191<>\"\",CHOOSE(WEEKDAY(E191,1),\"Dom.\",\"Seg.\",\"Ter.\",\"Qua.\",\"Qui.\",\"Sex.\",\"Sáb.\"),\"\")","v":"Dom."},"Seg.","Ter.","Qua.","Qui.","Sex.","Sáb.","Dom.","Seg.","Ter.","Qua.","Qui.","Sex.","Sáb.","Dom.","Seg.","Ter.","Qua.","Qui.","Sex.","Sáb.","Dom.","Seg.","Ter.","Qua.","Qui.","Sex.","Sáb.","Dom.",{"$nulls":3},{"$f":"IF(AK191<>\"\",CHOOSE(WEEKDAY(AK191,1),\"Dom.\",\"Seg.\",\"Ter.\",\"Qua.\",\"Qui.\",\"Sex.\",\"Sáb.\"),\"\")","v":""}]
[{"$nulls":3},{"$f":"A190","v":"2025-11-01"},{"$f":"IF(D191=\"\",\"\",IF(DAY(D191)<DAY(EOMONTH(D191,0)),D191+1,\"\"))","v":"2025-11-02"},{"$f":"IF(E191=\"\",\"\",IF(DAY(E191)<DAY(EOMONTH(E191,0)),E191+1,\"\"))","v":"2025-11-03"},"2025-11-04","2025-11-05","2025-11-06","2025-11-07","2025-11-08","2025-11-09","2025-11-10","2025-11-11","2025-11-12","2025-11-13","2025-11-14","2025-11-15","2025-11-16","2025-11-17","2025-11-18","2025-11-19","2025-11-20","2025-11-21","2025-11-22","2025-11-23","2025-11-24","2025-11-25","2025-11-26","2025-11-27","2025-11-28","2025-11-29","2025-11-30"]
[9,"-",10]
[10,"-",11,"Todos",{"$nulls":9},"São"]
[11,"-",12,"Santos",{"$nulls":9},"Martinho"]
[12,"-",13]
[]
[14,"-",15]
[15,"-",16,{"$nulls":10},"Torres"]
[16,"-",17,{"$nulls":10},"Vedras"]
[17,"-",18]
[]
[19,"-",20]
[20,"-",21]
[21,"-",22]
[]
[]
[]
["2025-12-01",null,null,{"$f":"IF(D209<>\"\",CHOOSE(WEEKDAY(D209,1),\"Dom.\",\"Seg.\",\"Ter.\",\"Qua.\",\"Qui.\",\"Sex.\",\"Sáb.\"),\"\")","v":"Seg."},{"$f":"IF(E209<>\"\",CHOOSE(WEEKDAY(E209,1),\"Dom.\",\"Seg.\",\"Ter.\",\"Qua.\",\"Qui.\",\"Sex.\",\"Sáb.\"),\"\")","v":"Ter."},"Qua.","Qui.","Sex.","Sáb.","Dom.","Seg.","Ter.","Qua.","Qui.","Sex.","Sáb.","Dom.","Seg.","Ter.","Qua.","Qui.","Sex.","Sáb.","Dom.","Seg.","Ter.","Qua.","Qui.","Sex.","Sáb.","Dom.","Seg.","Ter.","Qua.",null,null,{"$f":"IF(AK209<>\"\",CHOOSE(WEEKDAY(AK209,1),\"Dom.\",\"Seg.\",\"Ter.\",\"Qua.\",\"Qui.\",\"Sex.\",\"Sáb.\"),\"\")","v":""}]
[{"$nulls":3},{"$f":"A208","v":"2025-12-01"},{"$f":"IF(D209=\"\",\"\",IF(DAY(D209)<DAY(EOMONTH(D209,0)),D209+1,\"\"))","v":"2025-12-02"},{"$f":"IF(E209=\"\",\"\",IF(DAY(E209)<DAY(EOMONTH(E209,0)),E209+1,\"\"))","v":"2025-12-03"},"2025-12-04","2025-12-05","2025-12-06","2025-12-07","2025-12-08","2025-12-09","2025-12-10","2025-12-11","2025-12-12","2025-12-13","2025-12-14","2025-12-15","2025-12-16","2025-12-17","2025-12-18","2025-12-19","2025-12-20","2025-12-21","2025-12-22","2025-12-23","2025-12-24","2025-12-25","2025-12-26","2025-12-27","2025-12-28","2025-12-29","2025-12-30","2025-12-31"]
[9,"-",10]
[10,"-",11,"Rest.",{"$nulls":6},"Imacu."]
[11,"-",12,"Indep.",{"$nulls":6},"Concei.",{"$nulls":16},"NATAL"]
[12,"-",13]
[]
[14,"-",15]
[15,"-",16]
[16,"-",17]
[17,"-",18]
[]
[19,"-",20]
[20,"-",21]
[21,"-",22]